Target
Hepatocyte growth factor receptor
Ligand
BDBM50437161
Substrate
Meas. Tech.
ChEMBL_970209 (CHEMBL2406476)
IC50
600±n/a nM
Citation
 Steinig, AGLi, AHWang, JChen, XDong, HFerraro, CJin, MKadalbajoo, MKleinberg, AStolz, KMTavares-Greco, PAWang, TAlbertella, MRPeng, YCrew, LKahler, JKan, JSchulz, RCooke, ABittner, MTurton, RWFranklin, MGokhale, PLandfair, DMantis, CWorkman, JWild, RPachter, JEpstein, DMulvihill, MJ Novel 6-aminofuro[3,2-c]pyridines as potent, orally efficacious inhibitors of cMET and RON kinases. Bioorg Med Chem Lett 23:4381-7 (2013)  
Target
Name:
Hepatocyte growth factor receptor
Synonyms:
Hepatocyte growth factor receptor Hepatocyte growth factor receptor (c-MET) MET Met proto-oncogene (hepatocyte growth factor receptor) Tyrosine-protein kinase Met (c-Met) c-Met kinase
Type:
Protein
Mol. Mass.:
155559.73
Organism:
Homo sapiens (Human)
Description:
P08581
Residue:
1390
  
Inhibitor
Name:
BDBM50437161
Synonyms:
CHEMBL2401832
Type:
Small organic molecule
Emp. Form.:
C21H19Cl2FN4O3
Mol. Mass.:
465.305
SMILES:
C[C@@H](Oc1c(N)ncc2c(coc12)C1=CCN(CC1)C(N)=O)c1c(Cl)ccc(F)c1Cl
: