Target
E3 ubiquitin-protein ligase Mdm2
Ligand
BDBM50437212
Substrate
Meas. Tech.
ChEMBL_969491 (CHEMBL2406002)
IC50
22±n/a nM
Citation
 Ding, QZhang, ZLiu, JJJiang, NZhang, JRoss, TMChu, XJBartkovitz, DPodlaski, FJanson, CTovar, CFilipovic, ZMHiggins, BGlenn, KPackman, KVassilev, LTGraves, B Discovery of RG7388, a potent and selective p53-MDM2 inhibitor in clinical development. J Med Chem 56:5979-83 (2014)  
Target
Name:
E3 ubiquitin-protein ligase Mdm2
Synonyms:
Double minute 2 protein E3 ubiquitin-protein ligase Mdm2 (p53-binding protein Mdm2) Human Double Minute 2 (HDM2) MDM2-MDMX p53-Binding Protein MDM2 | p53-binding protein
Type:
Oncoprotein
Mol. Mass.:
55196.54
Organism:
Homo sapiens (Human)
Description:
Q00987
Residue:
491
  
Inhibitor
Name:
BDBM50437212
Synonyms:
CHEMBL2402731
Type:
Small organic molecule
Emp. Form.:
C30H27Cl2F2N3O3
Mol. Mass.:
586.456
SMILES:
CC(C)(C)C[C@@H]1N[C@H]([C@H](c2cccc(Cl)c2F)[C@@]1(C#N)c1ccc(Cl)cc1F)C(=O)Nc1ccc(cc1)C(O)=O
: