Target
Cyclin-dependent kinase 5 activator 1
Ligand
BDBM50437236
Substrate
Meas. Tech.
ChEMBL_969559 (CHEMBL2406223)
IC50
19±n/a nM
Citation
 Gucký, TJorda, RZatloukal, MBazgier, VBerka, KReznícková, EBéres, TStrnad, MKryštof, V A novel series of highly potent 2,6,9-trisubstituted purine cyclin-dependent kinase inhibitors. J Med Chem 56:6234-47 (2013)  
Target
Name:
Cyclin-dependent kinase 5 activator 1
Synonyms:
CDK5/p35 Cyclin-dependent kinase 5 regulatory subunit 1 | Cyclin-dependent kinase 5/CDK5 activator 1
Type:
Protein Complex
Mol. Mass.:
Description:
Components:
This complex has 2 components.
Component 1
Name:
Cyclin-dependent kinase 5
Synonyms:
CDK5 CDKN5 Cyclin-dependent kinase 5 (CDK5/ p25) Cyclin-dependent-like kinase 5 PSSALRE Tau protein kinase II catalytic subunit
Type:
Enzyme Subunit
Mol. Mass.:
33308.61
Organism:
Homo sapiens (Human)
Description:
Residue:
292
  
Component 2
Name:
Cyclin-dependent kinase 5 activator 1
Synonyms:
CD5R1_HUMAN CDK5R1 Cyclin-dependent kinase 5 (CDK5/p25) NCK5A p35
Type:
Enzyme Subunit
Mol. Mass.:
34077.43
Organism:
Homo sapiens (Human)
Description:
Q15078
Residue:
307
  
Inhibitor
Name:
BDBM50437236
Synonyms:
CHEMBL2402946
Type:
Small organic molecule
Emp. Form.:
C28H34N8O
Mol. Mass.:
498.6226
SMILES:
NC1CCC(CC1)Nc1nc(NCc2ccc(nc2)-c2ccccc2O)c2ncn(C3CCCC3)c2n1
: