Target
Major prion protein
Ligand
BDBM50437264
Substrate
Meas. Tech.
ChEMBL_972294 (CHEMBL2411805)
EC50
243±n/a nM
Citation
 Li, ZRao, SGever, JRWidjaja, KPrusiner, SBSilber, BM Optimization of Arylamides as Novel, Potent and Brain-penetrant Antiprion Lead Compounds. ACS Med Chem Lett 4:647-650 (2013)  
Target
Name:
Major prion protein
Synonyms:
CD_antigen=CD230 PRNP SIP
Type:
PROTEIN
Mol. Mass.:
27930.26
Organism:
Ovis aries
Description:
ChEMBL_107628
Residue:
256
  
Inhibitor
Name:
BDBM50437264
Synonyms:
CHEMBL2407257
Type:
Small organic molecule
Emp. Form.:
C24H26N4O
Mol. Mass.:
386.4894
SMILES:
CCN1CCN(CC1)c1ccc(NC(=O)c2ccc(cc2)-c2cccnc2)cc1
: