Target
Major prion protein
Ligand
BDBM50437267
Substrate
Meas. Tech.
ChEMBL_972294 (CHEMBL2411805)
EC50
221±n/a nM
Citation
 Li, ZRao, SGever, JRWidjaja, KPrusiner, SBSilber, BM Optimization of Arylamides as Novel, Potent and Brain-penetrant Antiprion Lead Compounds. ACS Med Chem Lett 4:647-650 (2013)  
Target
Name:
Major prion protein
Synonyms:
CD_antigen=CD230 PRNP SIP
Type:
PROTEIN
Mol. Mass.:
27930.26
Organism:
Ovis aries
Description:
ChEMBL_107628
Residue:
256
  
Inhibitor
Name:
BDBM50437267
Synonyms:
CHEMBL2407270
Type:
Small organic molecule
Emp. Form.:
C25H27N3O
Mol. Mass.:
385.5014
SMILES:
CCN1CCN(CC1)c1ccc(NC(=O)c2ccc(cc2)-c2ccccc2)cc1
: