Target
Replication protein A 70 kDa DNA-binding subunit
Ligand
BDBM50437287
Substrate
Meas. Tech.
ChEMBL_972453 (CHEMBL2412823)
Kd
>250000±n/a nM
Citation
 Patrone, JDKennedy, JPFrank, AOFeldkamp, MDVangamudi, BPelz, NFRossanese, OWWaterson, AGChazin, WJFesik, SW Discovery of Protein-Protein Interaction Inhibitors of Replication Protein A. ACS Med Chem Lett 4:601-605 (2013)  
Target
Name:
Replication protein A 70 kDa DNA-binding subunit
Synonyms:
REPA1 RFA1_HUMAN RPA1 Replication factor A protein 1 | Single-stranded DNA-binding protein
Type:
Enzyme
Mol. Mass.:
68139.43
Organism:
Homo sapiens (Human)
Description:
P27694
Residue:
616
  
Inhibitor
Name:
BDBM50437287
Synonyms:
CHEMBL2407479
Type:
Small organic molecule
Emp. Form.:
C17H14ClN3O3S
Mol. Mass.:
375.829
SMILES:
COc1ccc(cc1)-c1nnc(SCC(O)=O)n1-c1cccc(Cl)c1
: