Target
Replication protein A 70 kDa DNA-binding subunit
Ligand
BDBM50437311
Substrate
Meas. Tech.
ChEMBL_972453 (CHEMBL2412823)
Kd
47000±n/a nM
Citation
 Patrone, JDKennedy, JPFrank, AOFeldkamp, MDVangamudi, BPelz, NFRossanese, OWWaterson, AGChazin, WJFesik, SW Discovery of Protein-Protein Interaction Inhibitors of Replication Protein A. ACS Med Chem Lett 4:601-605 (2013)  
Target
Name:
Replication protein A 70 kDa DNA-binding subunit
Synonyms:
REPA1 RFA1_HUMAN RPA1 Replication factor A protein 1 | Single-stranded DNA-binding protein
Type:
Enzyme
Mol. Mass.:
68139.43
Organism:
Homo sapiens (Human)
Description:
P27694
Residue:
616
  
Inhibitor
Name:
BDBM50437311
Synonyms:
CHEMBL2407464
Type:
Small organic molecule
Emp. Form.:
C17H9ClFN3O2S2
Mol. Mass.:
405.854
SMILES:
OC(=O)c1sc2cc(ccc2c1Cl)-n1c(n[nH]c1=S)-c1ccc(F)cc1
: