Target
Methionine aminopeptidase 1
Ligand
BDBM50065785
Substrate
Meas. Tech.
ChEMBL_972464 (CHEMBL2412834)
IC50
>15000±n/a nM
Citation
 Wangtrakuldee, PByrd, MSCampos, CGHenderson, MWZhang, ZClare, MMasoudi, AMyler, PJHorn, JRCotter, PAHagen, TJ Discovery of Inhibitors of ACS Med Chem Lett 4:699-703 (2013)  
Target
Name:
Methionine aminopeptidase 1
Synonyms:
Aminopeptidase MAP 1 METAP1 Methionine Aminopeptidase Type 1 (MetAP1) | Peptidase M 1
Type:
Enzyme
Mol. Mass.:
43220.79
Organism:
Homo sapiens (Human)
Description:
MetAP1 with an N-terminal six histidine tag was expressed in baculovirus infected sf9 cells.
Residue:
386
  
Inhibitor
Name:
BDBM50065785
Synonyms:
2-Methyl-quinolin-8-ol | CHEMBL316892
Type:
Small organic molecule
Emp. Form.:
C10H9NO
Mol. Mass.:
159.1846
SMILES:
Cc1ccc2cccc(O)c2n1
: