Target
Myoglobin
Ligand
BDBM50437330
Substrate
Meas. Tech.
ChEMBL_972224 (CHEMBL2411426)
IC50
5300±n/a nM
Citation
 Shchepin, RVLiu, WYin, HZagol-Ikapitte, IAmin, TJeong, BSRoberts, LJOates, JAPorter, NABoutaud, O Rational Design of Novel Pyridinol-Fused Ring Acetaminophen Analogues. ACS Med Chem Lett 4:710-714 (2013)  
Target
Name:
Myoglobin
Synonyms:
MB | MYG_HUMAN
Type:
PROTEIN
Mol. Mass.:
17188.13
Organism:
Homo sapiens (Human)
Description:
ChEMBL_107627
Residue:
154
  
Inhibitor
Name:
BDBM50437330
Synonyms:
CHEMBL2407812
Type:
Small organic molecule
Emp. Form.:
C9H10N2O3
Mol. Mass.:
194.1873
SMILES:
Cc1nc2NC(=O)OCc2c(C)c1O
: