Target
Glycogen phosphorylase, muscle form
Ligand
BDBM50306550
Substrate
Meas. Tech.
ChEMBL_972498 (CHEMBL2409980)
Ki
16000±n/a nM
Citation
 Bokor, EDocsa, TGergely, PSomsák, L C-Glucopyranosyl-1,2,4-triazoles As New Potent Inhibitors of Glycogen Phosphorylase. ACS Med Chem Lett 4:612-5 (2013)  
Target
Name:
Glycogen phosphorylase, muscle form
Synonyms:
Glycogen Phosphorylase (PYGM) Glycogen phosphorylase, muscle form PYGM | PYGM_RABIT
Type:
Enzyme
Mol. Mass.:
97296.32
Organism:
Oryctolagus cuniculus (rabbit)
Description:
Phosphorylation of Ser-15 converts phosphorylase B (unphosphorylated) to phosphorylase A.
Residue:
843
  
Inhibitor
Name:
BDBM50306550
Synonyms:
1-(beta-D-Glucopyranosyl)-4-(2-naphthyl)-1,2,3-triazole CHEMBL600003
Type:
Small organic molecule
Emp. Form.:
C18H19N3O5
Mol. Mass.:
357.3606
SMILES:
OC[C@H]1O[C@H]([C@H](O)[C@@H](O)[C@@H]1O)n1cc(nn1)-c1ccc2ccccc2c1
: