Target
Alpha-glucosidase
Ligand
BDBM50437444
Substrate
Meas. Tech.
ChEMBL_974466 (CHEMBL2412538)
IC50
39000±n/a nM
Citation
 Martínez, RFAraújo, NJenkinson, SFNakagawa, SKato, AFleet, GW (3R,4S,5R,6R,7S)-3,4,5,7-Tetrahydroxyconidine, an azetidine analogue of 6,7-diepicastanospermine and a conformationally constrained d-deoxyaltronojirimycin, from l-arabinose. Bioorg Med Chem 21:4813-9 (2013)  
Target
Name:
Alpha-glucosidase
Synonyms:
AGLU_ASPNG | aglA
Type:
PROTEIN
Mol. Mass.:
108889.92
Organism:
Aspergillus niger
Description:
ChEMBL_974466
Residue:
985
  
Inhibitor
Name:
BDBM50437444
Synonyms:
CHEMBL2409320
Type:
Small organic molecule
Emp. Form.:
C5H11NO3
Mol. Mass.:
133.1457
SMILES:
OC[C@H](O)[C@@H]1NC[C@@H]1O
: