Target
Neuronal acetylcholine receptor subunit alpha-7
Ligand
BDBM50437497
Substrate
Meas. Tech.
ChEMBL_974584 (CHEMBL2410352)
Ki
27000±n/a nM
Citation
 Mazurov, AAKombo, DCAkireddy, SMurthy, SHauser, TAJordan, KGGatto, GJYohannes, D Novel nicotinic acetylcholine receptor agonists containing carbonyl moiety as a hydrogen bond acceptor. Bioorg Med Chem Lett 23:3927-34 (2013)  
Target
Name:
Neuronal acetylcholine receptor subunit alpha-7
Synonyms:
ACHA7_HUMAN Cholinergic, Nicotinic Alpha7 Neuronal acetylcholine receptor protein alpha-7 subunit Nicotinic acetylcholine receptor alpha-7 (alpha7 nAChR)
Type:
Mol. Mass.:
56448.33
Organism:
Homo sapiens (Human)
Description:
CHRNA7 (NACHRA7)
Residue:
502
  
Inhibitor
Name:
BDBM50437497
Synonyms:
CHEMBL3037926
Type:
Small organic molecule
Emp. Form.:
C9H16N2O
Mol. Mass.:
168.2361
SMILES:
CNC(=O)[C@@H]1C[C@@H]2CNC[C@@H]2C1
: