Target
Neuronal acetylcholine receptor subunit alpha-7
Ligand
BDBM50397903
Substrate
Meas. Tech.
ChEMBL_974584 (CHEMBL2410352)
Ki
20±n/a nM
Citation
 Mazurov, AAKombo, DCAkireddy, SMurthy, SHauser, TAJordan, KGGatto, GJYohannes, D Novel nicotinic acetylcholine receptor agonists containing carbonyl moiety as a hydrogen bond acceptor. Bioorg Med Chem Lett 23:3927-34 (2013)  
Target
Name:
Neuronal acetylcholine receptor subunit alpha-7
Synonyms:
ACHA7_HUMAN Cholinergic, Nicotinic Alpha7 Neuronal acetylcholine receptor protein alpha-7 subunit Nicotinic acetylcholine receptor alpha-7 (alpha7 nAChR)
Type:
Mol. Mass.:
56448.33
Organism:
Homo sapiens (Human)
Description:
CHRNA7 (NACHRA7)
Residue:
502
  
Inhibitor
Name:
BDBM50397903
Synonyms:
CHEMBL2179962
Type:
Small organic molecule
Emp. Form.:
C11H18N2O
Mol. Mass.:
194.2734
SMILES:
O=C(C1CC1)N1CC2CNCC(C2)C1
: