Target
Neuronal acetylcholine receptor subunit alpha-4/beta-2
Ligand
BDBM50437477
Substrate
Meas. Tech.
ChEMBL_974586 (CHEMBL2410354)
Ki
38±n/a nM
Citation
 Mazurov, AAKombo, DCAkireddy, SMurthy, SHauser, TAJordan, KGGatto, GJYohannes, D Novel nicotinic acetylcholine receptor agonists containing carbonyl moiety as a hydrogen bond acceptor. Bioorg Med Chem Lett 23:3927-34 (2013)  
Target
Name:
Neuronal acetylcholine receptor subunit alpha-4/beta-2
Synonyms:
Neuronal acetylcholine receptor Alpha-4/Beta-2 Neuronal acetylcholine receptor; alpha4/beta2 | nAChR subtypes alpha4 beta2
Type:
Protein
Mol. Mass.:
Description:
Components:
This complex has 2 components.
Component 1
Name:
Neuronal acetylcholine receptor subunit alpha-4
Synonyms:
ACHA4_HUMAN CHRNA4 protein Neuronal acetylcholine receptor protein alpha-4 subunit Nicotinic acetylcholine receptor alpha4/beta2/alpha5
Type:
Mol. Mass.:
69963.49
Organism:
Homo sapiens (Human)
Description:
NACHRA4
Residue:
627
  
Component 2
Name:
Neuronal acetylcholine receptor subunit beta-2
Synonyms:
ACHB2_HUMAN Neuronal acetylcholine receptor protein beta-2 subunit | Nicotinic acetylcholine receptor alpha3/beta2/alpha5
Type:
Protein
Mol. Mass.:
57020.50
Organism:
Homo sapiens (Human)
Description:
P17787
Residue:
502
  
Inhibitor
Name:
BDBM50437477
Synonyms:
CHEMBL2409493
Type:
Small organic molecule
Emp. Form.:
C8H14N2O
Mol. Mass.:
154.2096
SMILES:
CC(=O)N1CC2CNCC2C1
: