Target
Peptidyl-prolyl cis-trans isomerase NIMA-interacting 1
Ligand
BDBM50437702
Substrate
Meas. Tech.
ChEMBL_974630 (CHEMBL2410556)
IC50
1500±n/a nM
Citation
 Moore, JDPotter, A Pin1 inhibitors: Pitfalls, progress and cellular pharmacology. Bioorg Med Chem Lett 23:4283-91 (2013)  
Target
Name:
Peptidyl-prolyl cis-trans isomerase NIMA-interacting 1
Synonyms:
PIN1 PPIase Pin1 | Peptidyl-prolyl cis-trans isomerase NIMA-interacting 1
Type:
PROTEIN
Mol. Mass.:
18248.11
Organism:
Homo sapiens (Human)
Description:
ChEMBL_1502595
Residue:
163
  
Inhibitor
Name:
BDBM50437702
Synonyms:
CHEMBL2409069
Type:
Small organic molecule
Emp. Form.:
C35H49N8O9P
Mol. Mass.:
756.7855
SMILES:
[#6]-[#6](=O)-[#7]-[#6@@H](-[#6]-c1ccccc1)-[#6](=O)-[#7]-[#6@@H](-[#6]-c1ccccc1)-[#6](=O)-[#7]-[#6@@H](-[#6]-[#8]P([#8])([#8])=O)\[#6]=[#6]-1\[#6]-[#6]-[#6]-[#6@H]-1-[#6](=O)-[#7]-[#6@@H](-[#6]-[#6]-[#6]\[#7]=[#6](\[#7])-[#7])-[#6](-[#7])=O
: