Target
Peptidyl-prolyl cis-trans isomerase NIMA-interacting 1
Ligand
BDBM50437704
Substrate
Meas. Tech.
ChEMBL_974634 (CHEMBL2410560)
Ki
50±n/a nM
Citation
 Moore, JDPotter, A Pin1 inhibitors: Pitfalls, progress and cellular pharmacology. Bioorg Med Chem Lett 23:4283-91 (2013)  
Target
Name:
Peptidyl-prolyl cis-trans isomerase NIMA-interacting 1
Synonyms:
PIN1 PPIase Pin1 | Peptidyl-prolyl cis-trans isomerase NIMA-interacting 1
Type:
PROTEIN
Mol. Mass.:
18248.11
Organism:
Homo sapiens (Human)
Description:
ChEMBL_1502595
Residue:
163
  
Inhibitor
Name:
BDBM50437704
Synonyms:
CHEMBL2409078
Type:
Small organic molecule
Emp. Form.:
C12H20N2S3
Mol. Mass.:
288.496
SMILES:
S=C(SC(=S)N1CCCCC1)N1CCCCC1
: