Target
Nuclear receptor corepressor 1
Ligand
BDBM50437810
Substrate
Meas. Tech.
ChEMBL_973950 (CHEMBL2410097)
IC50
388±n/a nM
Citation
 Marson, CMMatthews, CJYiannaki, EAtkinson, SJSoden, PEShukla, LLamadema, NThomas, NS Discovery of potent, isoform-selective inhibitors of histone deacetylase containing chiral heterocyclic capping groups and a N-(2-aminophenyl)benzamide binding unit. J Med Chem 56:6156-74 (2013)  
Target
Name:
Nuclear receptor corepressor 1
Synonyms:
KIAA1047 N-CoR1 NCOR1_HUMAN
Type:
PROTEIN
Mol. Mass.:
270226.27
Organism:
Homo sapiens (Human)
Description:
ChEMBL_107910
Residue:
2440
  
Inhibitor
Name:
BDBM50437810
Synonyms:
CHEMBL2407725
Type:
Small organic molecule
Emp. Form.:
C29H26N4OS
Mol. Mass.:
478.608
SMILES:
Nc1ccccc1NC(=O)c1ccc(CN=C2N[C@H]([C@@H](S2)c2ccccc2)c2ccccc2)cc1
: