Target
Nuclear receptor corepressor 1
Ligand
BDBM50437835
Substrate
Meas. Tech.
ChEMBL_973950 (CHEMBL2410097)
IC50
>20000±n/a nM
Citation
 Marson, CMMatthews, CJYiannaki, EAtkinson, SJSoden, PEShukla, LLamadema, NThomas, NS Discovery of potent, isoform-selective inhibitors of histone deacetylase containing chiral heterocyclic capping groups and a N-(2-aminophenyl)benzamide binding unit. J Med Chem 56:6156-74 (2013)  
Target
Name:
Nuclear receptor corepressor 1
Synonyms:
KIAA1047 N-CoR1 NCOR1_HUMAN
Type:
PROTEIN
Mol. Mass.:
270226.27
Organism:
Homo sapiens (Human)
Description:
ChEMBL_107910
Residue:
2440
  
Inhibitor
Name:
BDBM50437835
Synonyms:
CHEMBL2407740
Type:
Small organic molecule
Emp. Form.:
C29H24N6O
Mol. Mass.:
472.5405
SMILES:
Nc1cc(ccc1NC(=O)c1ccc(CNc2nccc(n2)-c2cccnc2)cc1)-c1ccccc1
: