Target
G protein-activated inward rectifier potassium channel 4
Ligand
BDBM50437980
Substrate
Meas. Tech.
ChEMBL_972874 (CHEMBL2411651)
EC50
>30000±n/a nM
Citation
 Wen, WWu, WRomaine, IMKaufmann, KDu, YSulikowski, GAWeaver, CDLindsley, CW Discovery of 'molecular switches' within a GIRK activator scaffold that afford selective GIRK inhibitors. Bioorg Med Chem Lett 23:4562-6 (2013)  
Target
Name:
G protein-activated inward rectifier potassium channel 4
Synonyms:
CIR GIRK-4 Heart KATP channel Inward rectifier K(+) channel Kir3.4 KCNJ5 Potassium channel, inwardly rectifying subfamily J member 5
Type:
PROTEIN
Mol. Mass.:
47658.06
Organism:
Homo sapiens (Human)
Description:
ChEMBL_107914
Residue:
419
  
Inhibitor
Name:
BDBM50437980
Synonyms:
CHEMBL2409109
Type:
Small organic molecule
Emp. Form.:
C16H13F2N5O
Mol. Mass.:
329.3041
SMILES:
Cc1cc(NC(=O)Nc2ccc(F)c(F)c2)n(n1)-c1ccccn1
: