Target
Mitogen-activated protein kinase kinase kinase 7/TGF-beta-activated kinase 1 and MAP3K7-binding protein 1
Ligand
BDBM50438174
Substrate
Meas. Tech.
ChEMBL_973093 (CHEMBL2412856)
IC50
3200±n/a nM
Citation
 Hornberger, KRBerger, DMCrew, APDong, HKleinberg, ALi, AHMedeiros, MRMulvihill, MJSiu, KTarrant, JWang, JWeng, FWilde, VLAlbertella, MBittner, MCooke, AGray, MJMaresca, PMay, EMeyn, PPeick, WRomashko, DTanowitz, MTokar, B Discovery and optimization of 7-aminofuro[2,3-c]pyridine inhibitors of TAK1. Bioorg Med Chem Lett 23:4517-22 (2013)  
Target
Name:
Mitogen-activated protein kinase kinase kinase 7/TGF-beta-activated kinase 1 and MAP3K7-binding protein 1
Synonyms:
Mitogen-activated protein kinase kinase kinase 7 interacting protein 1 TAK1/TAB1
Type:
Mol. Mass.:
Description:
ASSAY_ID of EBI is 739577
Components:
This complex has 2 components.
Component 1
Name:
TGF-beta-activated kinase 1 and MAP3K7-binding protein 1
Synonyms:
MAP3K7IP1 TAB1 TAK1-binding protein 1 | TGF-beta-activated kinase 1-binding protein1
Type:
Enzyme
Mol. Mass.:
54633.89
Organism:
Homo sapiens (Human)
Description:
Q15750
Residue:
504
  
Component 2
Name:
Mitogen-activated protein kinase kinase kinase 7
Synonyms:
M3K7_HUMAN Mitogen-activated protein kinase kinase kinase 7 TAK1/TAB1 Transforming growth factor-beta-activated kinase 1 (TAK1)
Type:
Protein
Mol. Mass.:
67199.89
Organism:
Homo sapiens (Human)
Description:
O43318
Residue:
606
  
Inhibitor
Name:
BDBM50438174
Synonyms:
CHEMBL2407794
Type:
Small organic molecule
Emp. Form.:
C25H26N6O3
Mol. Mass.:
458.5123
SMILES:
CC(=O)Nc1cccc(c1)-c1cc2c(cnc(N)c2o1)-c1cnn(c1)C1CCN(CC1)C(C)=O
: