Target
Glyceraldehyde-3-phosphate dehydrogenase, glycosomal
Ligand
BDBM50438270
Substrate
Meas. Tech.
ChEMBL_973313 (CHEMBL2412700)
Ki
59490±n/a nM
Citation
 Soares, FASesti-Costa, Rda Silva, JSde Souza, MCFerreira, VFSantos, Fda CMonteiro, PALeitão, AMontanari, CA Molecular design, synthesis and biological evaluation of 1,4-dihydro-4-oxoquinoline ribonucleosides as TcGAPDH inhibitors with trypanocidal activity. Bioorg Med Chem Lett 23:4597-601 (2013)  
Target
Name:
Glyceraldehyde-3-phosphate dehydrogenase, glycosomal
Synonyms:
G3PG_TRYCR
Type:
PROTEIN
Mol. Mass.:
39070.68
Organism:
Trypanosoma cruzi
Description:
ChEMBL_973242
Residue:
359
  
Inhibitor
Name:
BDBM50438270
Synonyms:
CHEMBL2408386
Type:
Small organic molecule
Emp. Form.:
C16H17NO8
Mol. Mass.:
351.3081
SMILES:
COc1ccc2c(c1)n(cc(C(O)=O)c2=O)[C@@H]1O[C@H](CO)[C@@H](O)[C@H]1O
: