Target
Metabotropic glutamate receptor 5
Ligand
BDBM50438277
Substrate
Meas. Tech.
ChEMBL_973452 (CHEMBL2410491)
IC50
28±n/a nM
Citation
 Kubas, HMeyer, UKrueger, BHechenberger, MVanejevs, MZemribo, RKauss, VAmbartsumova, RPyatkin, IPolosukhin, AIAbel, U Discovery, synthesis, and structure-activity relationships of 2-aminoquinazoline derivatives as a novel class of metabotropic glutamate receptor 5 negative allosteric modulators. Bioorg Med Chem Lett 23:4493-500 (2013)  
Target
Name:
Metabotropic glutamate receptor 5
Synonyms:
GPRC1E GRM5_HUMAN metabotropic glutamate 5 | metabotropic glutamate 5a
Type:
Enzyme
Mol. Mass.:
132484.72
Organism:
Homo sapiens (Human)
Description:
Residue:
1212
  
Inhibitor
Name:
BDBM50438277
Synonyms:
CHEMBL2408412
Type:
Small organic molecule
Emp. Form.:
C18H15NO
Mol. Mass.:
261.3178
SMILES:
CC1CC(=O)c2cc(cnc2C1)C#Cc1ccccc1
: