Target
Mitogen-activated protein kinase kinase kinase 7/TGF-beta-activated kinase 1 and MAP3K7-binding protein 1
Ligand
BDBM50438318
Substrate
Meas. Tech.
ChEMBL_973540 (CHEMBL2410824)
IC50
4900±n/a nM
Citation
 Hornberger, KRChen, XCrew, APKleinberg, AMa, LMulvihill, MJWang, JWilde, VLAlbertella, MBittner, MCooke, AKadhim, SKahler, JMaresca, PMay, EMeyn, PRomashko, DTokar, BTurton, R Discovery of 7-aminofuro[2,3-c]pyridine inhibitors of TAK1: optimization of kinase selectivity and pharmacokinetics. Bioorg Med Chem Lett 23:4511-6 (2013)  
Target
Name:
Mitogen-activated protein kinase kinase kinase 7/TGF-beta-activated kinase 1 and MAP3K7-binding protein 1
Synonyms:
Mitogen-activated protein kinase kinase kinase 7 interacting protein 1 TAK1/TAB1
Type:
Mol. Mass.:
Description:
ASSAY_ID of EBI is 739577
Components:
This complex has 2 components.
Component 1
Name:
TGF-beta-activated kinase 1 and MAP3K7-binding protein 1
Synonyms:
MAP3K7IP1 TAB1 TAK1-binding protein 1 | TGF-beta-activated kinase 1-binding protein1
Type:
Enzyme
Mol. Mass.:
54633.89
Organism:
Homo sapiens (Human)
Description:
Q15750
Residue:
504
  
Component 2
Name:
Mitogen-activated protein kinase kinase kinase 7
Synonyms:
M3K7_HUMAN Mitogen-activated protein kinase kinase kinase 7 TAK1/TAB1 Transforming growth factor-beta-activated kinase 1 (TAK1)
Type:
Protein
Mol. Mass.:
67199.89
Organism:
Homo sapiens (Human)
Description:
O43318
Residue:
606
  
Inhibitor
Name:
BDBM50438318
Synonyms:
CHEMBL2408618
Type:
Small organic molecule
Emp. Form.:
C19H14N4OS
Mol. Mass.:
346.406
SMILES:
Cn1ccc(c1)-c1cnc(N)c2oc(cc12)-c1csc2cnccc12
: