Target
Mitogen-activated protein kinase kinase kinase 7
Ligand
BDBM50438321
Substrate
Meas. Tech.
ChEMBL_973538 (CHEMBL2410822)
IC50
1000±n/a nM
Citation
 Hornberger, KRChen, XCrew, APKleinberg, AMa, LMulvihill, MJWang, JWilde, VLAlbertella, MBittner, MCooke, AKadhim, SKahler, JMaresca, PMay, EMeyn, PRomashko, DTokar, BTurton, R Discovery of 7-aminofuro[2,3-c]pyridine inhibitors of TAK1: optimization of kinase selectivity and pharmacokinetics. Bioorg Med Chem Lett 23:4511-6 (2013)  
Target
Name:
Mitogen-activated protein kinase kinase kinase 7
Synonyms:
M3K7_HUMAN Mitogen-activated protein kinase kinase kinase 7 TAK1/TAB1 Transforming growth factor-beta-activated kinase 1 (TAK1)
Type:
Protein
Mol. Mass.:
67199.89
Organism:
Homo sapiens (Human)
Description:
O43318
Residue:
606
  
Inhibitor
Name:
BDBM50438321
Synonyms:
CHEMBL2408731
Type:
Small organic molecule
Emp. Form.:
C19H15N5OS
Mol. Mass.:
361.42
SMILES:
Cc1nn(C)cc1-c1cnc(N)c2oc(cc12)-c1csc2cnccc12
: