Target
Mitogen-activated protein kinase kinase kinase 7
Ligand
BDBM50438329
Substrate
Meas. Tech.
ChEMBL_973538 (CHEMBL2410822)
IC50
20±n/a nM
Citation
 Hornberger, KRChen, XCrew, APKleinberg, AMa, LMulvihill, MJWang, JWilde, VLAlbertella, MBittner, MCooke, AKadhim, SKahler, JMaresca, PMay, EMeyn, PRomashko, DTokar, BTurton, R Discovery of 7-aminofuro[2,3-c]pyridine inhibitors of TAK1: optimization of kinase selectivity and pharmacokinetics. Bioorg Med Chem Lett 23:4511-6 (2013)  
Target
Name:
Mitogen-activated protein kinase kinase kinase 7
Synonyms:
M3K7_HUMAN Mitogen-activated protein kinase kinase kinase 7 TAK1/TAB1 Transforming growth factor-beta-activated kinase 1 (TAK1)
Type:
Protein
Mol. Mass.:
67199.89
Organism:
Homo sapiens (Human)
Description:
O43318
Residue:
606
  
Inhibitor
Name:
BDBM50438329
Synonyms:
CHEMBL2408616
Type:
Small organic molecule
Emp. Form.:
C23H20F2N6O2S
Mol. Mass.:
482.506
SMILES:
Nc1ncc(-c2cnn(c2)[C@H]2CC[C@H](O)CC2)c2c(C(F)F)c(oc12)-c1cccc2nnsc12
: