Target
Dihydrofolate reductase
Ligand
BDBM50438443
Substrate
Meas. Tech.
ChEMBL_975943 (CHEMBL2415592)
IC50
5000±n/a nM
Citation
 Hassan, GSEl-Messery, SMAl-Omary, FAAl-Rashood, STShabayek, MIAbulfadl, YSHabib, el-SEEl-Hallouty, SMFayad, WMohamed, KMEl-Menshawi, BSEl-Subbagh, HI Nonclassical antifolates, part 4. 5-(2-aminothiazol-4-yl)-4-phenyl-4H-1,2,4-triazole-3-thiols as a new class of DHFR inhibitors: synthesis, biological evaluation and molecular modeling study. Eur J Med Chem 66:135-45 (2013)  
Target
Name:
Dihydrofolate reductase
Synonyms:
DHFR Dihydrofolate reductase | Dihydrofolate reductase (DHFR)
Type:
Enzyme
Mol. Mass.:
21603.71
Organism:
Bos taurus (Cattle)
Description:
P00376
Residue:
187
  
Inhibitor
Name:
BDBM50438443
Synonyms:
CHEMBL2414364
Type:
Small organic molecule
Emp. Form.:
C16H15N5O3S2
Mol. Mass.:
389.452
SMILES:
COc1ccc(cc1)-n1c(n[nH]c1=S)-c1csc(n1)N(C(C)=O)C(C)=O
: