Target
Ribonuclease pancreatic
Ligand
BDBM50438445
Substrate
Meas. Tech.
ChEMBL_975987 (CHEMBL2415636)
Ki
202000±n/a nM
Citation
 Datta, DSamanta, ADasgupta, SPathak, T 3'-Oxo-, amino-, thio- and sulfone-acetic acid modified thymidines: effect of increased acidity on ribonuclease A inhibition. Bioorg Med Chem 21:4634-45 (2013)  
Target
Name:
Ribonuclease pancreatic
Synonyms:
CAM-RNase A RNASE1 RNS1
Type:
Enzyme
Mol. Mass.:
16468.79
Organism:
Bison bison (American bison)
Description:
carboxamidomethylated RNase A
Residue:
150
  
Inhibitor
Name:
BDBM50438445
Synonyms:
CHEMBL2414517
Type:
Small organic molecule
Emp. Form.:
C13H18N2O8S
Mol. Mass.:
362.356
SMILES:
COC(=O)CS(=O)(=O)C[C@H]1O[C@H](C[C@@H]1O)n1cc(C)c(=O)[nH]c1=O
: