Target
Lysosomal alpha-glucosidase
Ligand
BDBM50333465
Substrate
Meas. Tech.
ChEMBL_976221 (CHEMBL2415870)
IC50
3300±n/a nM
Citation
 Bian, XFan, XKe, CLuan, YZhao, GZeng, A Synthesis anda-glucosidase inhibitory activity evaluation of N-substituted aminomethyl-ß-d-glucopyranosides. Bioorg Med Chem 21:5442-50 (2013)  
Target
Name:
Lysosomal alpha-glucosidase
Synonyms:
Acidic alpha-glucosidase LYAG_RAT
Type:
PROTEIN
Mol. Mass.:
106191.24
Organism:
Rattus norvegicus
Description:
ChEMBL_1506157
Residue:
953
  
Inhibitor
Name:
BDBM50333465
Synonyms:
(2R,3R,4R,5R,6R)-5-((2R,3R,4R,5S,6R)-5-((2R,3R,4S,5S,6R)-3,4-dihydroxy-6-methyl-5-((1S,4R,5S,6S)-4,5,6-trihydroxy-3-(hydroxymethyl)cyclohex-2-enylamino)-tetrahydro-2H-pyran-2-yloxy)-3,4-dihydroxy-6-(hydroxymethyl)-tetrahydro-2H-pyran-2-yloxy)-6-(hydroxymethyl)-tetrahydro-2H-pyran-2,3,4-triol (2R,3R,4R,5S,6R)-5-((2R,3R,4R,5S,6R)-5-((2R,3R,4S,5S,6R)-3,4-dihydroxy-6-methyl-5-((1S,4S,5S,6S)-4,5,6-trihydroxy-3-(hydroxymethyl)cyclohex-2-enylamino)-tetrahydro-2H-pyran-2-yloxy)-3,4-dihydroxy-6-(hydroxymethyl)-tetrahydro-2H-pyran-2-yloxy)-6-(hydroxymethyl)-tetrahydro-2H-pyran-2,3,4-triol 5-{5-[3,4-Dihydroxy-6-methyl-5-(4,5,6-trihydroxy-3-hydroxymethyl-cyclohex-2-enylamino)-tetrahydro-pyran-2-yloxy]-3,4-dihydroxy-6-hydroxymethyl-tetrahydro-pyran-2-yloxy}-6-hydroxymethyl-tetrahydro-pyran-2,3,4-triol CHEMBL1566 Precose | acarbose
Type:
Small organic molecule
Emp. Form.:
C25H43NO18
Mol. Mass.:
645.6048
SMILES:
C[C@H]1O[C@H](O[C@@H]2[C@@H](CO)O[C@H](O[C@@H]3[C@@H](CO)O[C@@H](O)[C@H](O)[C@H]3O)[C@H](O)[C@H]2O)[C@H](O)[C@@H](O)[C@@H]1N[C@H]1C=C(CO)[C@@H](O)[C@H](O)[C@H]1O
: