Target
Nitric oxide synthase, endothelial
Ligand
BDBM50438642
Substrate
Meas. Tech.
ChEMBL_976154 (CHEMBL2415803)
Ki
27963±n/a nM
Citation
 Jing, QLi, HFang, JRoman, LJMartásek, PPoulos, TLSilverman, RB In search of potent and selective inhibitors of neuronal nitric oxide synthase with more simple structures. Bioorg Med Chem 21:5323-31 (2013)  
Target
Name:
Nitric oxide synthase, endothelial
Synonyms:
Constitutive NOS Endothelial nitric oxide synthase NOS type III NOS3_BOVIN Nitric-oxide synthase, endothelial | cNOS
Type:
Enzyme
Mol. Mass.:
133292.26
Organism:
Bos taurus (bovine)
Description:
Recombinant eNOS overexpressed in E. coli was used in enzyme assays.
Residue:
1205
  
Inhibitor
Name:
BDBM50438642
Synonyms:
CHEMBL2414432 | US9732037, Compound 3
Type:
Small organic molecule
Emp. Form.:
C19H25N3O2
Mol. Mass.:
327.4207
SMILES:
Cc1cc(N)nc(COc2cccc(OCC3CCNCC3)c2)c1
: