Target
Heme oxygenase 1
Ligand
BDBM50438658
Substrate
Meas. Tech.
ChEMBL_976175 (CHEMBL2415824)
IC50
60±n/a nM
Citation
 Salerno, LPittalà, VRomeo, GModica, MNSiracusa, MADi Giacomo, CAcquaviva, RBarbagallo, ITibullo, DSorrenti, V Evaluation of novel aryloxyalkyl derivatives of imidazole and 1,2,4-triazole as heme oxygenase-1 (HO-1) inhibitors and their antitumor properties. Bioorg Med Chem 21:5145-53 (2013)  
Target
Name:
Heme oxygenase 1
Synonyms:
HMOX1_RAT Heme Oxygenase 1 (HO-1) Hmox1
Type:
Enzyme
Mol. Mass.:
33005.15
Organism:
Rattus norvegicus (rat)
Description:
HO-1 obtained from rat spleen was used in enzyme assays.
Residue:
289
  
Inhibitor
Name:
BDBM50438658
Synonyms:
CHEMBL1188560
Type:
Small organic molecule
Emp. Form.:
C13H15IN2O
Mol. Mass.:
342.1755
SMILES:
OC(CCc1ccc(I)cc1)Cn1ccnc1
: