Target
Orexin receptor type 2
Ligand
BDBM50438807
Substrate
Meas. Tech.
ChEMBL_977032 (CHEMBL2416556)
Kd
2.0±n/a nM
Citation
 Lebold, TPBonaventure, PShireman, BT Selective orexin receptor antagonists. Bioorg Med Chem Lett 23:4761-9 (2013)  
Target
Name:
Orexin receptor type 2
Synonyms:
HCRTR2 OX2R_HUMAN Orexin receptor type 2 (OR-2) Orexin receptor type 2 (OX2R) Ox-2-R | Ox2-R
Type:
Protein
Mol. Mass.:
50710.53
Organism:
Homo sapiens (Human)
Description:
O43614
Residue:
444
  
Inhibitor
Name:
BDBM50438807
Synonyms:
CHEMBL2413517
Type:
Small organic molecule
Emp. Form.:
C26H31N3O3
Mol. Mass.:
433.5426
SMILES:
CCOc1cccc(c1)C(=O)N(C)[C@H](CCNC(=O)c1cccn1C)Cc1ccccc1
: