Target
Tyrosyl-DNA phosphodiesterase 2
Ligand
BDBM34905
Substrate
Meas. Tech.
ChEMBL_978850 (CHEMBL2423452)
IC50
1510±n/a nM
Citation
 Raoof, ADepledge, PHamilton, NMHamilton, NSHitchin, JRHopkins, GVJordan, AMMaguire, LAMcGonagle, AEMould, DPRushbrooke, MSmall, HFSmith, KMThomson, GJTurlais, FWaddell, IDWaszkowycz, BWatson, AJOgilvie, DJ Toxoflavins and deazaflavins as the first reported selective small molecule inhibitors of tyrosyl-DNA phosphodiesterase II. J Med Chem 56:6352-70 (2013)  
Target
Name:
Tyrosyl-DNA phosphodiesterase 2
Synonyms:
EAP2 ETS1-associated protein 2 TDP2 TTRAP Tyr-DNA phosphodiesterase 2 Tyrosyl-DNA phosphodiesterase 2 (hTDP2) VPg unlinkase | hTDP2
Type:
Enzyme Catalytic Domain
Mol. Mass.:
40916.54
Organism:
Homo sapiens (Human)
Description:
gi_23510348
Residue:
362
  
Inhibitor
Name:
BDBM34905
Synonyms:
1,6-dimethyl-3-propyl-pyrimido[5,4-e][1,2,4]triazine-5,7-dione 1,6-dimethyl-3-propylpyrimido[5,4-e][1,2,4]triazine-5,7-dione SMR000291200 cid_3164059
Type:
Small organic molecule
Emp. Form.:
C10H13N5O2
Mol. Mass.:
235.2425
SMILES:
CCCc1nn(C)c2nc(=O)n(C)c(=O)c2n1
: