Target
Thymidine phosphorylase
Ligand
BDBM50439105
Substrate
Meas. Tech.
ChEMBL_977519 (CHEMBL2423136)
Ki
19570±n/a nM
Citation
 Bera, HTan, BJSun, LDolzhenko, AVChui, WKChiu, GN A structure-activity relationship study of 1,2,4-triazolo[1,5-a][1,3,5]triazin-5,7-dione and its 5-thioxo analogues on anti-thymidine phosphorylase and associated anti-angiogenic activities. Eur J Med Chem 67:325-34 (2013)  
Target
Name:
Thymidine phosphorylase
Synonyms:
ECGF1 PD-ECGF TP TYPH_HUMAN Thymidine Phosphorylase (TP) | Thymidine phosphorylase
Type:
Enzyme
Mol. Mass.:
49948.87
Organism:
Homo sapiens (Human)
Description:
The recombinant human thymidine phosphorylase (V79TP) was expressed in V79 Chinese hamster cells (Sigma, T-9319).
Residue:
482
  
Inhibitor
Name:
BDBM50439105
Synonyms:
CHEMBL2418061
Type:
Small organic molecule
Emp. Form.:
C11H7Cl2N5OS
Mol. Mass.:
328.177
SMILES:
Clc1ccc(Cc2nc3[nH]c(=S)[nH]c(=O)n3n2)cc1Cl
: