Target
ALK tyrosine kinase receptor
Ligand
BDBM50439167
Substrate
Meas. Tech.
ChEMBL_978272 (CHEMBL2423641)
IC50
247±n/a nM
Citation
 Gummadi, VRRajagopalan, SLooi, CYPaydar, MRenukappa, GAAinan, BRKrishnamurthy, NRPanigrahi, SKMahasweta, KRaghuramachandran, SRajappa, MRamanathan, ALakshminarasimhan, ARamachandra, MWong, PFMustafa, MRNanduri, SHosahalli, S Discovery of 7-azaindole based anaplastic lymphoma kinase (ALK) inhibitors: wild type and mutant (L1196M) active compounds with unique binding mode. Bioorg Med Chem Lett 23:4911-8 (2013)  
Target
Name:
ALK tyrosine kinase receptor
Synonyms:
ALK ALK_HUMAN CD_antigen: CD246
Type:
Protein
Mol. Mass.:
176453.10
Organism:
Homo sapiens (Human)
Description:
Q9UM73
Residue:
1620
  
Inhibitor
Name:
BDBM50439167
Synonyms:
CHEMBL2418756
Type:
Small organic molecule
Emp. Form.:
C22H17F3N6
Mol. Mass.:
422.4058
SMILES:
Cn1cc(cn1)-c1cnc2[nH]cc(-c3cnn(Cc4cccc(c4)C(F)(F)F)c3)c2c1
: