Target
ALK tyrosine kinase receptor
Ligand
BDBM50439169
Substrate
Meas. Tech.
ChEMBL_978272 (CHEMBL2423641)
IC50
85±n/a nM
Citation
 Gummadi, VRRajagopalan, SLooi, CYPaydar, MRenukappa, GAAinan, BRKrishnamurthy, NRPanigrahi, SKMahasweta, KRaghuramachandran, SRajappa, MRamanathan, ALakshminarasimhan, ARamachandra, MWong, PFMustafa, MRNanduri, SHosahalli, S Discovery of 7-azaindole based anaplastic lymphoma kinase (ALK) inhibitors: wild type and mutant (L1196M) active compounds with unique binding mode. Bioorg Med Chem Lett 23:4911-8 (2013)  
Target
Name:
ALK tyrosine kinase receptor
Synonyms:
ALK ALK_HUMAN CD_antigen: CD246
Type:
Protein
Mol. Mass.:
176453.10
Organism:
Homo sapiens (Human)
Description:
Q9UM73
Residue:
1620
  
Inhibitor
Name:
BDBM50439169
Synonyms:
CHEMBL2418751
Type:
Small organic molecule
Emp. Form.:
C21H17FN6
Mol. Mass.:
372.3983
SMILES:
Cn1cc(cn1)-c1cnc2[nH]cc(-c3cnn(Cc4ccccc4F)c3)c2c1
: