Target
Short transient receptor potential channel 3
Ligand
BDBM50439217
Substrate
Meas. Tech.
ChEMBL_978642 (CHEMBL2422305)
IC50
100±n/a nM
Citation
 Washburn, DGHolt, DADodson, JMcAtee, JJTerrell, LRBarton, LManns, SWaszkiewicz, APritchard, CGillie, DJMorrow, DMDavenport, EALozinskaya, IMGuss, JBasilla, JBNegron, LKKlein, MWillette, RNFries, REJensen, TCXu, XSchnackenberg, CGMarino, JP The discovery of potent blockers of the canonical transient receptor channels, TRPC3 and TRPC6, based on an anilino-thiazole pharmacophore. Bioorg Med Chem Lett 23:4979-84 (2013)  
Target
Name:
Short transient receptor potential channel 3
Synonyms:
TRP-3 TRPC3 Transient receptor protein 3 hTrp3
Type:
PROTEIN
Mol. Mass.:
96009.35
Organism:
Homo sapiens (Human)
Description:
ChEMBL_107641
Residue:
836
  
Inhibitor
Name:
BDBM50439217
Synonyms:
CHEMBL2418811
Type:
Small organic molecule
Emp. Form.:
C18H21ClFN3OS
Mol. Mass.:
381.895
SMILES:
C[C@H]1CCCN([C@H]1C)C(=O)c1nc(Nc2ccc(Cl)cc2F)sc1C
: