Target
Short transient receptor potential channel 3
Ligand
BDBM50439220
Substrate
Meas. Tech.
ChEMBL_978642 (CHEMBL2422305)
IC50
80±n/a nM
Citation
 Washburn, DGHolt, DADodson, JMcAtee, JJTerrell, LRBarton, LManns, SWaszkiewicz, APritchard, CGillie, DJMorrow, DMDavenport, EALozinskaya, IMGuss, JBasilla, JBNegron, LKKlein, MWillette, RNFries, REJensen, TCXu, XSchnackenberg, CGMarino, JP The discovery of potent blockers of the canonical transient receptor channels, TRPC3 and TRPC6, based on an anilino-thiazole pharmacophore. Bioorg Med Chem Lett 23:4979-84 (2013)  
Target
Name:
Short transient receptor potential channel 3
Synonyms:
TRP-3 TRPC3 Transient receptor protein 3 hTrp3
Type:
PROTEIN
Mol. Mass.:
96009.35
Organism:
Homo sapiens (Human)
Description:
ChEMBL_107641
Residue:
836
  
Inhibitor
Name:
BDBM50439220
Synonyms:
CHEMBL2418807
Type:
Small organic molecule
Emp. Form.:
C18H21N3O3S
Mol. Mass.:
359.443
SMILES:
CC1CCCN(C1C)C(=O)c1csc(Nc2ccc3OCOc3c2)n1
: