Target
Arginase-2, mitochondrial
Ligand
BDBM50439240
Substrate
Meas. Tech.
ChEMBL_978892 (CHEMBL2423683)
IC50
230±n/a nM
Citation
 Golebiowski, AWhitehouse, DBeckett, RPVan Zandt, MJi, MKRyder, TRJagdmann, EAndreoli, MLee, YSheeler, RConway, BOlczak, JMazur, MCzestkowski, WPiotrowska, WCousido-Siah, ARuiz, FXMitschler, APodjarny, ASchroeter, H Synthesis of quaternarya-amino acid-based arginase inhibitors via the Ugi reaction. Bioorg Med Chem Lett 23:4837-41 (2013)  
Target
Name:
Arginase-2, mitochondrial
Synonyms:
ARG2 Arginase II Non-hepatic arginase | Type II arginase
Type:
PROTEIN
Mol. Mass.:
38576.93
Organism:
Homo sapiens (Human)
Description:
ChEMBL_978892
Residue:
354
  
Inhibitor
Name:
BDBM50439240
Synonyms:
CHEMBL2418993
Type:
Small organic molecule
Emp. Form.:
C16H33BN2O4
Mol. Mass.:
328.255
SMILES:
CC(C)CCN1CCC(CC1)C(N)(CCCCB(O)O)C(O)=O
: