Target
P2Y purinoceptor 12
Ligand
BDBM50439277
Substrate
Meas. Tech.
ChEMBL_977532 (CHEMBL2423149)
IC50
11±n/a nM
Citation
 Bach, PAntonsson, TBylund, RBjörkman, JAÖsterlund, KGiordanetto, Fvan Giezen, JJAndersen, SMZachrisson, HZetterberg, F Lead optimization of ethyl 6-aminonicotinate acyl sulfonamides as antagonists of the P2Y12 receptor. separation of the antithrombotic effect and bleeding for candidate drug AZD1283. J Med Chem 56:7015-24 (2013)  
Target
Name:
P2Y purinoceptor 12
Synonyms:
ADP-glucose receptor HORK3 P2T(AC) P2Y(AC) P2Y(cyc) P2Y12 platelet ADP receptor Purinergic receptor P2Y12 | SP1999
Type:
Enzyme
Mol. Mass.:
39458.48
Organism:
Homo sapiens (Human)
Description:
Q9H244
Residue:
342
  
Inhibitor
Name:
BDBM50439277
Synonyms:
CHEMBL2419490
Type:
Small organic molecule
Emp. Form.:
C23H26N4O5S
Mol. Mass.:
470.541
SMILES:
CCOC(=O)c1cc(C#N)c(nc1C)N1CCC(CC1)C(=O)NS(=O)(=O)Cc1ccccc1
: