Target
G protein-activated inward rectifier potassium channel 1
Ligand
BDBM50439404
Substrate
Meas. Tech.
ChEMBL_980168 (CHEMBL2424002)
EC50
3600±n/a nM
Citation
 Ramos-Hunter, SJEngers, DWKaufmann, KDu, YLindsley, CWWeaver, CDSulikowski, GA Discovery and SAR of a novel series of GIRK1/2 and GIRK1/4 activators. Bioorg Med Chem Lett 23:5195-8 (2013)  
Target
Name:
G protein-activated inward rectifier potassium channel 1
Synonyms:
GIRK-1 Inward rectifier K(+) channel Kir3.1 KCNJ3_HUMAN | Potassium channel, inwardly rectifying subfamily J member 3
Type:
PROTEIN
Mol. Mass.:
56610.74
Organism:
Homo sapiens (Human)
Description:
ChEMBL_107915
Residue:
501
  
Inhibitor
Name:
BDBM50439404
Synonyms:
CHEMBL2420539
Type:
Small organic molecule
Emp. Form.:
C17H19FN2O3S
Mol. Mass.:
350.408
SMILES:
CN(C)S(=O)(=O)c1cc(NC(=O)Cc2ccc(F)cc2)ccc1C
: