Target
NAD-dependent protein deacetylase sirtuin-3, mitochondrial
Ligand
BDBM50439468
Substrate
Meas. Tech.
ChEMBL_978758 (CHEMBL2423001)
IC50
8350±n/a nM
Citation
 Mellini, PKokkola, TSuuronen, TSalo, HSTolvanen, LMai, ALahtela-Kakkonen, MJarho, EM Screen of pseudopeptidic inhibitors of human sirtuins 1-3: two lead compounds with antiproliferative effects in cancer cells. J Med Chem 56:6681-95 (2013)  
Target
Name:
NAD-dependent protein deacetylase sirtuin-3, mitochondrial
Synonyms:
NAD-dependent deacetylase sirtuin 3 SIR2L3 SIRT3
Type:
Protein
Mol. Mass.:
43582.69
Organism:
Homo sapiens (Human)
Description:
Q9NTG7
Residue:
399
  
Inhibitor
Name:
BDBM50439468
Synonyms:
CHEMBL2417682
Type:
Small organic molecule
Emp. Form.:
C25H31N3O5S
Mol. Mass.:
485.596
SMILES:
COc1ccc(cc1)C(=O)CNC(=O)[C@H](CCCCNC(C)=S)NC(=O)OCc1ccccc1
: