Target
Coagulation factor VII
Ligand
BDBM50439487
Substrate
Meas. Tech.
ChEMBL_979046 (CHEMBL2421099)
IC50
11±n/a nM
Citation
 Bolton, SASutton, JCAnumula, RBisacchi, GSJacobson, BSlusarchyk, WATreuner, UDWu, SCZhao, GPi, ZSheriff, SSmirk, RABisaha, SCheney, DLWei, ASchumacher, WAHartl, KSLiu, EZahler, RSeiler, SM Discovery of nonbenzamidine factor VIIa inhibitors using a biaryl acid scaffold. Bioorg Med Chem Lett 23:5239-43 (2013)  
Target
Name:
Coagulation factor VII
Synonyms:
Eptacog alfa FA7_HUMAN Factor VIIa (fVIIa) SPCA serum prothrombin conversion accelerator
Type:
Enzyme
Mol. Mass.:
51599.89
Organism:
Homo sapiens (Human)
Description:
Residue:
466
  
Inhibitor
Name:
BDBM50439487
Synonyms:
CHEMBL2417893
Type:
Small organic molecule
Emp. Form.:
C30H31N5O5
Mol. Mass.:
541.5976
SMILES:
CCOc1ccc(-c2ccc(cc2C(O)=O)C(=O)NCC(C)(C)C)c(n1)C(=O)Nc1ccc2c(N)nccc2c1
: