Target
Heat shock protein 75 kDa, mitochondrial
Ligand
BDBM20732
Substrate
Meas. Tech.
ChEMBL_977708 (CHEMBL2424065)
IC50
661±n/a nM
Citation
 Taldone, TPatel, PDPatel, MPatel, HJEvans, CERodina, AOchiana, SShah, SKUddin, MGewirth, DChiosis, G Experimental and structural testing module to analyze paralogue-specificity and affinity in the Hsp90 inhibitors series. J Med Chem 56:6803-18 (2013)  
Target
Name:
Heat shock protein 75 kDa, mitochondrial
Synonyms:
HSP75 TRAP1_HUMAN
Type:
PROTEIN
Mol. Mass.:
80120.13
Organism:
Homo sapiens (Human)
Description:
ChEMBL_1478164
Residue:
704
  
Inhibitor
Name:
BDBM20732
Synonyms:
(4E,6Z,8S,9S,10E,12S,13R,14S,16R)-13-hydroxy-8,14,19-trimethoxy-4,10,12,16-tetramethyl-3,20,22-trioxo-2-azabicyclo[16.3.1]docosa-1(21),4,6,10,18-pentaen-9-yl carbamate CHEMBL278315 Geldanamycin | geldanomycin
Type:
Emp. Form.:
C29H40N2O9
Mol. Mass.:
560.6359
SMILES:
CO[C@H]1CC(C)=Cc2c(O)c(NC(=O)C(C)=CC=C[C@H](OC)[C@@H](OC(N)=O)\C(C)=C\[C@H](C)[C@H]1O)cc(O)c2OC
: