Target
Sucrase-isomaltase, intestinal
Ligand
BDBM50439692
Substrate
Meas. Tech.
ChEMBL_979085 (CHEMBL2421541)
Ki
47500±n/a nM
Citation
 Rattanangkool, EKittikhunnatham, PDamsud, TWacharasindhu, SPhuwapraisirisan, P Quercitylcinnamates, a new series of antidiabetic bioconjugates possessinga-glucosidase inhibition and antioxidant. Eur J Med Chem 66:296-304 (2013)  
Target
Name:
Sucrase-isomaltase, intestinal
Synonyms:
SUIS_RAT Sucrase-isomaltase | alpha-Glucosidase (α-Glucosidase)
Type:
Enzyme
Mol. Mass.:
210329.04
Organism:
Rattus norvegicus (Rat)
Description:
P23739
Residue:
1841
  
Inhibitor
Name:
BDBM50439692
Synonyms:
CHEMBL2418233
Type:
Small organic molecule
Emp. Form.:
C15H18O8
Mol. Mass.:
326.2986
SMILES:
O[C@@H]1C[C@@H](OC(=O)\C=C\c2ccc(O)c(O)c2)[C@H](O)[C@H](O)[C@H]1O
: