Target
Sodium- and chloride-dependent glycine transporter 2
Ligand
BDBM50439743
Substrate
Meas. Tech.
ChEMBL_980598 (CHEMBL2423115)
IC50
340±n/a nM
Citation
 Sugane, TTobe, THamaguchi, WShimada, IMaeno, KMiyata, JSuzuki, TKimizuka, TSakamoto, STsukamoto, S Atropisomeric 4-phenyl-4H-1,2,4-triazoles as selective glycine transporter 1 inhibitors. J Med Chem 56:5744-56 (2014)  
Target
Name:
Sodium- and chloride-dependent glycine transporter 2
Synonyms:
Glycine transporter 2 SC6A5_RAT | Slc6a5
Type:
PROTEIN
Mol. Mass.:
87845.43
Organism:
Rattus norvegicus
Description:
ChEMBL_980598
Residue:
799
  
Inhibitor
Name:
BDBM50439743
Synonyms:
CHEMBL2419425
Type:
Small organic molecule
Emp. Form.:
C23H22N4
Mol. Mass.:
354.4476
SMILES:
CCc1nnc(-c2ccc(cc2)-c2ccccc2)n1-c1cccc(N)c1C
: