Target
Sodium- and chloride-dependent glycine transporter 2
Ligand
BDBM50335010
Substrate
Meas. Tech.
ChEMBL_980598 (CHEMBL2423115)
IC50
230±n/a nM
Citation
 Sugane, TTobe, THamaguchi, WShimada, IMaeno, KMiyata, JSuzuki, TKimizuka, TSakamoto, STsukamoto, S Atropisomeric 4-phenyl-4H-1,2,4-triazoles as selective glycine transporter 1 inhibitors. J Med Chem 56:5744-56 (2014)  
Target
Name:
Sodium- and chloride-dependent glycine transporter 2
Synonyms:
Glycine transporter 2 SC6A5_RAT | Slc6a5
Type:
PROTEIN
Mol. Mass.:
87845.43
Organism:
Rattus norvegicus
Description:
ChEMBL_980598
Residue:
799
  
Inhibitor
Name:
BDBM50335010
Synonyms:
3-Biphenyl-4-yl-5-ethyl-4-(2-fluorophenyl)-1,2,4-triazole | CHEMBL1649974
Type:
Small organic molecule
Emp. Form.:
C22H18FN3
Mol. Mass.:
343.3968
SMILES:
CCc1nnc(-c2ccc(cc2)-c2ccccc2)n1-c1ccccc1F
: