Target
Type-1 angiotensin II receptor
Ligand
BDBM50035462
Substrate
Meas. Tech.
ChEMBL_982135 (CHEMBL2428850)
IC50
0.140000±n/a nM
Citation
  TBA Med Chem Res 0:1-17 (2013)    Article 
Target
Name:
Type-1 angiotensin II receptor
Synonyms:
AGTR1 ANGIOTENSIN AT1 Angiotensin II type 1a (AT-1a) receptor
Type:
Enzyme Catalytic Domain
Mol. Mass.:
41009.15
Organism:
RABBIT
Description:
ANGIOTENSIN AT1 AGTR1 RABBIT::P34976
Residue:
359
  
Inhibitor
Name:
BDBM50035462
Synonyms:
4'-{3-Butyl-1-[2-chloro-5-(3-propyl-ureido)-phenyl]-5-oxo-1,5-dihydro-[1,2,4]triazol-4-ylmethyl}-biphenyl-2-sulfonic acid 2-chloro-benzoylamide | CHEMBL139452
Type:
Small organic molecule
Emp. Form.:
C36H36Cl2N6O5S
Mol. Mass.:
735.679
SMILES:
CCCCc1nn(-c2cc(NC(=O)NCCC)ccc2Cl)c(=O)n1Cc1ccc(cc1)-c1ccccc1S(=O)(=O)NC(=O)c1ccccc1Cl
: