Target
Cyclin-dependent kinase 11B
Ligand
BDBM50440018
Substrate
Meas. Tech.
ChEMBL_982260 (CHEMBL2429327)
Kd
1300±n/a nM
Citation
 Palmer, WSAlam, MArzeno, HBChang, KCDunn, JPGoldstein, DMGong, LGoyal, BHermann, JCHogg, JHHsieh, GJahangir, AJanson, CJin, SUrsula Kammlott, RKuglstatter, ALukacs, CMichoud, CNiu, LReuter, DCShao, ASilva, TTrejo-Martin, TAStein, KTan, YCTivitmahaisoon, PTran, PWagner, PWeller, PWu, SY Development of amino-pyrimidine inhibitors of c-Jun N-terminal kinase (JNK): kinase profiling guided optimization of a 1,2,3-benzotriazole lead. Bioorg Med Chem Lett 23:1486-92 (2013)  
Target
Name:
Cyclin-dependent kinase 11B
Synonyms:
2.7.11.22 CDC2L1 CDK11B Cell division cycle 2-like protein kinase 1 Cyclin-dependent kinase Cyclin-dependent kinase 11B PITSLRE serine/threonine-protein kinase CDC2L1 PK58 | p58 CLK-1
Type:
Protein
Mol. Mass.:
92685.77
Organism:
Homo sapiens (Human)
Description:
P21127
Residue:
795
  
Inhibitor
Name:
BDBM50440018
Synonyms:
CHEMBL2425628
Type:
Small organic molecule
Emp. Form.:
C28H37N5O5S
Mol. Mass.:
555.689
SMILES:
CS(=O)(=O)CCCOc1cccc2n(ccc12)-c1ccnc(N[C@H]2CC[C@@H](CC2)C(=O)N2CCC(O)CC2)n1
: