Target
Glutamate receptor ionotropic, NMDA 2D
Ligand
BDBM50440048
Substrate
Meas. Tech.
ChEMBL_983749 (CHEMBL2427902)
IC50
13000±n/a nM
Citation
 Acker, TMKhatri, AVance, KMSlabber, CBacsa, JSnyder, JPTraynelis, SFLiotta, DC Structure-activity relationships and pharmacophore model of a noncompetitive pyrazoline containing class of GluN2C/GluN2D selective antagonists. J Med Chem 56:6434-56 (2013)  
Target
Name:
Glutamate receptor ionotropic, NMDA 2D
Synonyms:
GluN2D Grin2d NMDAR2D | NMDE4_RAT
Type:
Protein
Mol. Mass.:
143129.52
Organism:
Rattus norvegicus (Rat)
Description:
Q62645
Residue:
1323
  
Inhibitor
Name:
BDBM50440048
Synonyms:
CHEMBL2425975
Type:
Small organic molecule
Emp. Form.:
C29H21ClN4O4
Mol. Mass.:
524.954
SMILES:
OC(=O)CCC(=O)N1N=C(CC1c1ccc(Cl)cc1)c1c(-c2cccc(c2)C#N)c2ccccc2[nH]c1=O
: