Target
Glutamate receptor ionotropic, NMDA 2C
Ligand
BDBM50440050
Substrate
Meas. Tech.
ChEMBL_983748 (CHEMBL2427901)
IC50
4000±n/a nM
Citation
 Acker, TMKhatri, AVance, KMSlabber, CBacsa, JSnyder, JPTraynelis, SFLiotta, DC Structure-activity relationships and pharmacophore model of a noncompetitive pyrazoline containing class of GluN2C/GluN2D selective antagonists. J Med Chem 56:6434-56 (2013)  
Target
Name:
Glutamate receptor ionotropic, NMDA 2C
Synonyms:
Glutamate NMDA receptor; Grin1/Grin2c Grin2c NMDE3_RAT
Type:
Protein
Mol. Mass.:
135305.94
Organism:
Rattus norvegicus (Rat)
Description:
Q00961
Residue:
1237
  
Inhibitor
Name:
BDBM50440050
Synonyms:
CHEMBL2425973
Type:
Small organic molecule
Emp. Form.:
C29H24ClN3O4
Mol. Mass.:
513.972
SMILES:
Cc1cccc(c1)-c1c(C2=NN(C(C2)c2ccc(Cl)cc2)C(=O)CCC(O)=O)c(=O)[nH]c2ccccc12
: